Reaction Details
TargetEndothelin-1 receptor
LigandBDBM50000567
Substrate/Competitorn/a
Meas. Tech.ChEBML_65799
IC50 7600±n/a nM
Citation Doherty, AM Endothelin: a new challenge. J Med Chem35:1493-508 (1992) Endothelin-1 receptor
Name:Endothelin-1 receptor
Type:PROTEIN
Mol. Mass.:48707.29
Organism:Sus scrofa
Description:ChEMBL_65803
Residue:427
BDBM50000567
NameBDBM50000567
Synonyms:CHEMBL287980 | Sodium; ({2-[2-({2-[(azepane-1-carbonyl)-amino]-4-methyl-pentanoyl}-methyl-amino)-3-(1H-indol-3-yl)-propionylamino]-3-pyridin-2-yl-propionyl}-methyl-amino)-acetate
TypeSmall organic molecule
Emp. Form.C36H48N7O6
Mol. Mass.674.8102
SMILESCC(C)C[C@@H](NC(=O)N1CCCCCC1)C(=O)N(C)[C@@H](Cc1c[nH]c2ccccc12)C(=O)N[C@H](Cc1ccccn1)C(=O)N(C)CC([O-])=O