Reaction Details
TargetEndothelin-1 receptor
LigandBDBM50000568
Substrate/Competitorn/a
Meas. Tech.ChEBML_65799
IC50 32000±n/a nM
Citation Doherty, AM Endothelin: a new challenge. J Med Chem35:1493-508 (1992) Endothelin-1 receptor
Name:Endothelin-1 receptor
Type:PROTEIN
Mol. Mass.:48707.29
Organism:Sus scrofa
Description:ChEMBL_65803
Residue:427
BDBM50000568
NameBDBM50000568
Synonyms:2-[2-({2-[2-(2-Chloro-phenyl)-acetylamino]-4-methyl-pentanoyl}-methyl-amino)-3-(1H-indol-3-yl)-propionylamino]-4-methyl-pentanoic acid | CHEMBL431699
TypeSmall organic molecule
Emp. Form.C32H41ClN4O5
Mol. Mass.597.145
SMILESCC(C)C[C@@H](NC(=O)[C@H](Cc1c[nH]c2ccccc12)N(C)C(=O)[C@@H](CC(C)C)NC(=O)Cc1ccccc1Cl)C(O)=O