Reaction Details
TargetTrifunctional purine biosynthetic protein adenosine-3
LigandBDBM50024475
Substrate/Competitorn/a
Meas. Tech.ChEMBL_70042 (CHEMBL681442)
Ki 65±n/a nM
Citation Rosowsky, AForsch, RAReich, VEFreisheim, JHMoran, RG Side chain modified 5-deazafolate and 5-deazatetrahydrofolate analogues as mammalian folylpolyglutamate synthetase and glycinamide ribonucleotide formyltransferase inhibitors: synthesis and in vitro biological evaluation. J Med Chem35:1578-88 (1992) Trifunctional purine biosynthetic protein adenosine-3
Name:Trifunctional purine biosynthetic protein adenosine-3
Type:PROTEIN
Mol. Mass.:107504.27
Organism:Mus musculus
Description:ChEMBL_497843
Residue:1010
BDBM50024475
NameBDBM50024475
Synonyms:2-{4-[(2-Amino-4-oxo-1,4,5,6,7,8-hexahydro-quinazolin-6-ylmethyl)-amino]-benzoylamino}-pentanedioic acid CHEMBL279508
TypeSmall organic molecule
Emp. Form.C21H25N5O6
Mol. Mass.443.4531
SMILESNc1nc2CCC(CNc3ccc(cc3)C(=O)NC(CCC(O)=O)C(O)=O)Cc2c(=O)[nH]1