Reaction Details
TargetFolylpolyglutamate synthase, mitochondrial
LigandBDBM50005860
Substrate/Competitorn/a
Meas. Tech.ChEBML_68543
Ki 115000±n/a nM
Citation Rosowsky, AForsch, RAReich, VEFreisheim, JHMoran, RG Side chain modified 5-deazafolate and 5-deazatetrahydrofolate analogues as mammalian folylpolyglutamate synthetase and glycinamide ribonucleotide formyltransferase inhibitors: synthesis and in vitro biological evaluation. J Med Chem35:1578-88 (1992) Folylpolyglutamate synthase, mitochondrial
Name:Folylpolyglutamate synthase, mitochondrial
Type:PROTEIN
Mol. Mass.:64969.76
Organism:Mus musculus
Description:ChEMBL_68680
Residue:587
BDBM50005860
NameBDBM50005860
Synonyms:2-{4-[(2-Amino-4-oxo-3,4,5,6,7,8-hexahydro-pyrido[2,3-d]pyrimidin-6-ylmethyl)-amino]-benzoylamino}-4-(ethoxy-hydroxy-phosphoryl)-butyric acid | CHEMBL41459
TypeSmall organic molecule
Emp. Form.C21H29N6O7P
Mol. Mass.508.4647
SMILESCCOP(O)(=O)CCC(NC(=O)c1ccc(NCC2CNc3nc(N)[nH]c(=O)c3C2)cc1)C(O)=O