Reaction Details
TargetTrifunctional purine biosynthetic protein adenosine-3
LigandBDBM50002471
Substrate/Competitorn/a
Meas. Tech.ChEMBL_73021 (CHEMBL682623)
Ki 3700±n/a nM
Citation Rosowsky, AForsch, RAReich, VEFreisheim, JHMoran, RG Side chain modified 5-deazafolate and 5-deazatetrahydrofolate analogues as mammalian folylpolyglutamate synthetase and glycinamide ribonucleotide formyltransferase inhibitors: synthesis and in vitro biological evaluation. J Med Chem35:1578-88 (1992) Trifunctional purine biosynthetic protein adenosine-3
Name:Trifunctional purine biosynthetic protein adenosine-3
Type:PROTEIN
Mol. Mass.:107504.27
Organism:Mus musculus
Description:ChEMBL_497843
Residue:1010
BDBM50002471
NameBDBM50002471
Synonyms:5-Amino-2-{4-[(2-amino-4-oxo-2,3,4,4a,5,6,7,8-octahydro-pyrido[2,3-d]pyrimidin-6-ylmethyl)-amino]-benzoylamino}-pentanoic acid CHEMBL289923
TypeSmall organic molecule
Emp. Form.C20H27N7O4
Mol. Mass.429.4729
SMILESNCCCC(NC(=O)c1ccc(NCC2CNc3nc(N)[nH]c(=O)c3C2)cc1)C(O)=O