Reaction Details
TargetNeutrophil elastase
LigandBDBM50005897
Substrate/Competitorn/a
Meas. Tech.ChEMBL_96634 (CHEMBL705706)
Ki 150±n/a nM
Citation Zembower, DEKam, CMPowers, JCZalkow, LH Novel anthraquinone inhibitors of human leukocyte elastase and cathepsin G. J Med Chem35:1597-605 (1992) Neutrophil elastase
Name:Neutrophil elastase
Type:Enzyme
Mol. Mass.:28532.38
Organism:Homo sapiens (Human)
Description:P08246
Residue:267
BDBM50005897
NameBDBM50005897
Synonyms:CHEMBL40840 | Carbonic acid 8-butoxycarbonyloxy-3-methyl-9,10-dioxo-6-propoxy-9,10-dihydro-anthracen-1-yl ester butyl ester
TypeSmall organic molecule
Emp. Form.C28H32O9
Mol. Mass.512.5483
SMILESCCCCOC(=O)Oc1cc(C)cc2C(=O)c3cc(OCCC)cc(OC(=O)OCCCC)c3C(=O)c12