Reaction Details
TargetNeutrophil elastase
LigandBDBM11318
Substrate/Competitorn/a
Meas. Tech.ChEMBL_63645 (CHEMBL873592)
IC50 52000±n/a nM
Citation Zembower, DEKam, CMPowers, JCZalkow, LH Novel anthraquinone inhibitors of human leukocyte elastase and cathepsin G. J Med Chem35:1597-605 (1992) Neutrophil elastase
Name:Neutrophil elastase
Type:Enzyme
Mol. Mass.:28532.38
Organism:Homo sapiens (Human)
Description:P08246
Residue:267
BDBM11318
NameBDBM11318
Synonyms:1,3,8-trihydroxy-6-methyl-9,10-dihydroanthracene-9,10-dione CHEMBL289277 US20230364057, Compound 242 | med.21724, Compound 24
TypeSmall organic molecule
Emp. Form.C15H10O5
Mol. Mass.270.2369
SMILESCc1cc(O)c2C(=O)c3c(O)cc(O)cc3C(=O)c2c1