Reaction Details
TargetPlatelet-activating factor receptor
LigandBDBM50006092
Substrate/Competitorn/a
Meas. Tech.ChEBML_221704
IC50 130±n/a nM
Citation Wissner, ACarroll, MLGreen, KEKerwar, SSPickett, WCSchaub, RETorley, LWWrenn, SKohler, CA Analogues of platelet activating factor. 6. Mono- and bis-aryl phosphate antagonists of platelet activating factor. J Med Chem35:1650-62 (1992) Platelet-activating factor receptor
Name:Platelet-activating factor receptor
Type:Protein
Mol. Mass.:39005.63
Organism:Cavia porcellus
Description:n/a
Residue:342
BDBM50006092
NameBDBM50006092
Synonyms:3-{3-[(2,6-Di-tert-butyl-4-dodecyloxy-phenoxy)-hydroxy-phosphoryloxy]-benzyl}-thiazol-3-ium | CHEMBL45182
TypeSmall organic molecule
Emp. Form.C36H54NO5PS
Mol. Mass.643.856
SMILESCCCCCCCCCCCCOc1cc(c(OP([O-])(=O)Oc2cccc(C[n+]3ccsc3)c2)c(c1)C(C)(C)C)C(C)(C)C