Reaction Details
TargetCholecystokinin receptor type A
LigandBDBM50046130
Substrate/Competitorn/a
Meas. Tech.ChEMBL_49724 (CHEMBL661966)
Ki 2100±n/a nM
Citation Corringer, PJWeng, JHDucos, BDurieux, CBoudeau, PBohme, ARoques, BP CCK-B agonist or antagonist activities of structurally hindered and peptidase-resistant Boc-CCK4 derivatives. J Med Chem36:166-72 (1993) Cholecystokinin receptor type A
Name:Cholecystokinin receptor type A
Type:n/a
Mol. Mass.:48229.77
Organism:Cavia porcellus
Description:n/a
Residue:430
BDBM50046130
NameBDBM50046130
Synonyms:3-(2-Amino-3-naphthalen-1-yl-propionylamino)-N-({[1-tert-butoxycarbonyl-2-(1H-indol-3-yl)-ethyl]-methyl-carbamoyl}-cyclohexyl-methyl)-succinamic acid | CHEMBL3351052
TypeSmall organic molecule
Emp. Form.C41H51N5O7
Mol. Mass.725.8729
SMILESCN([C@@H](Cc1c[nH]c2ccccc12)C(=O)OC(C)(C)C)C(=O)[C@@H](NC(=O)[C@H](CC(O)=O)NC(=O)[C@@H](N)Cc1cccc2ccccc12)C1CCCCC1