Reaction Details
TargetGastrin/cholecystokinin type B receptor
LigandBDBM50046114
Substrate/Competitorn/a
Meas. Tech.ChEBML_48094
Ki 17±n/a nM
Citation Corringer, PJWeng, JHDucos, BDurieux, CBoudeau, PBohme, ARoques, BP CCK-B agonist or antagonist activities of structurally hindered and peptidase-resistant Boc-CCK4 derivatives. J Med Chem36:166-72 (1993) Gastrin/cholecystokinin type B receptor
Name:Gastrin/cholecystokinin type B receptor
Type:G Protein-Coupled Receptor (GPCR)
Mol. Mass.:48445.79
Organism:Homo sapiens (Human)
Description:Stable expression of human CCK-2 receptors in HEK 293 cells.
Residue:447
BDBM50046114
NameBDBM50046114
Synonyms:3-(2-Amino-3-naphthalen-1-yl-propionylamino)-N-{[1-tert-butoxycarbonyl-2-(1H-indol-3-yl)-ethylcarbamoyl]-cyclohexyl-methyl}-succinamic acid | CHEMBL3351058
TypeSmall organic molecule
Emp. Form.C40H49N5O7
Mol. Mass.711.8464
SMILESCC(C)(C)OC(=O)[C@H](Cc1c[nH]c2ccccc12)NC(=O)[C@@H](NC(=O)[C@H](CC(O)=O)NC(=O)[C@@H](N)Cc1cccc2ccccc12)C1CCCCC1