Reaction Details
TargetGastrin/cholecystokinin type B receptor
LigandBDBM50046117
Substrate/Competitorn/a
Meas. Tech.ChEBML_48094
Ki 590±n/a nM
Citation Corringer, PJWeng, JHDucos, BDurieux, CBoudeau, PBohme, ARoques, BP CCK-B agonist or antagonist activities of structurally hindered and peptidase-resistant Boc-CCK4 derivatives. J Med Chem36:166-72 (1993) Gastrin/cholecystokinin type B receptor
Name:Gastrin/cholecystokinin type B receptor
Type:G Protein-Coupled Receptor (GPCR)
Mol. Mass.:48445.79
Organism:Homo sapiens (Human)
Description:Stable expression of human CCK-2 receptors in HEK 293 cells.
Residue:447
BDBM50046117
NameBDBM50046117
Synonyms:3-(2-Amino-3-phenyl-propionylamino)-N-(1-{[1-tert-butoxycarbonyl-2-(1H-indol-3-yl)-ethyl]-methyl-carbamoyl}-2-phenyl-ethyl)-succinamic acid | CHEMBL3351048
TypeSmall organic molecule
Emp. Form.C38H45N5O7
Mol. Mass.683.7932
SMILESCN([C@@H](Cc1c[nH]c2ccccc12)C(=O)OC(C)(C)C)C(=O)[C@H](Cc1ccccc1)NC(=O)[C@H](CC(O)=O)NC(=O)[C@@H](N)Cc1ccccc1