Reaction Details
TargetGastrin/cholecystokinin type B receptor
LigandBDBM50046120
Substrate/Competitorn/a
Meas. Tech.ChEBML_48094
Ki 74±n/a nM
Citation Corringer, PJWeng, JHDucos, BDurieux, CBoudeau, PBohme, ARoques, BP CCK-B agonist or antagonist activities of structurally hindered and peptidase-resistant Boc-CCK4 derivatives. J Med Chem36:166-72 (1993) Gastrin/cholecystokinin type B receptor
Name:Gastrin/cholecystokinin type B receptor
Type:G Protein-Coupled Receptor (GPCR)
Mol. Mass.:48445.79
Organism:Homo sapiens (Human)
Description:Stable expression of human CCK-2 receptors in HEK 293 cells.
Residue:447
BDBM50046120
NameBDBM50046120
Synonyms:CHEMBL3351056 | N-{[1-tert-Butoxycarbonyl-2-(1H-indol-3-yl)-ethylcarbamoyl]-cyclohexyl-methyl}-3-(2-dimethylamino-3-naphthalen-1-yl-propionylamino)-succinamic acid
TypeSmall organic molecule
Emp. Form.C42H53N5O7
Mol. Mass.739.8995
SMILESCN(C)[C@@H](Cc1cccc2ccccc12)C(=O)N[C@@H](CC(O)=O)C(=O)N[C@@H](C1CCCCC1)C(=O)N[C@@H](Cc1c[nH]c2ccccc12)C(=O)OC(C)(C)C