Reaction Details
TargetCholecystokinin receptor type A
LigandBDBM50046119
Substrate/Competitorn/a
Meas. Tech.ChEBML_49724
Ki 990±n/a nM
Citation Corringer, PJWeng, JHDucos, BDurieux, CBoudeau, PBohme, ARoques, BP CCK-B agonist or antagonist activities of structurally hindered and peptidase-resistant Boc-CCK4 derivatives. J Med Chem36:166-72 (1993) Cholecystokinin receptor type A
Name:Cholecystokinin receptor type A
Type:n/a
Mol. Mass.:48229.77
Organism:Cavia porcellus
Description:n/a
Residue:430
BDBM50046119
NameBDBM50046119
Synonyms:3-(2-Amino-3-naphthalen-1-yl-propionylamino)-N-{[1-tert-butoxycarbonyl-2-(1H-indol-3-yl)-ethylcarbamoyl]-phenyl-methyl}-succinamic acid | CHEMBL3351055
TypeSmall organic molecule
Emp. Form.C40H43N5O7
Mol. Mass.705.7987
SMILESCC(C)(C)OC(=O)[C@H](Cc1c[nH]c2ccccc12)NC(=O)[C@@H](NC(=O)[C@H](CC(O)=O)NC(=O)[C@@H](N)Cc1cccc2ccccc12)c1ccccc1