Reaction Details
TargetCholecystokinin receptor type A
LigandBDBM50046131
Substrate/Competitorn/a
Meas. Tech.ChEBML_49724
Ki 520±n/a nM
Citation Corringer, PJWeng, JHDucos, BDurieux, CBoudeau, PBohme, ARoques, BP CCK-B agonist or antagonist activities of structurally hindered and peptidase-resistant Boc-CCK4 derivatives. J Med Chem36:166-72 (1993) Cholecystokinin receptor type A
Name:Cholecystokinin receptor type A
Type:n/a
Mol. Mass.:48229.77
Organism:Cavia porcellus
Description:n/a
Residue:430
BDBM50046131
NameBDBM50046131
Synonyms:CHEMBL3351059 | N-(1-{[1-tert-Butoxycarbonyl-2-(1H-indol-3-yl)-ethyl]-methyl-carbamoyl}-pentyl)-3-(2-dimethylamino-3-naphthalen-1-yl-propionylamino)-succinamic acid
TypeSmall organic molecule
Emp. Form.C41H53N5O7
Mol. Mass.727.8888
SMILESCCCC[C@H](NC(=O)[C@H](CC(O)=O)NC(=O)[C@H](Cc1cccc2ccccc12)N(C)C)C(=O)N(C)[C@@H](Cc1c[nH]c2ccccc12)C(=O)OC(C)(C)C