Reaction Details
Target5-hydroxytryptamine receptor 1A
LigandBDBM50034330
Substrate/Competitorn/a
Meas. Tech.ChEMBL_581 (CHEMBL615451)
Ki 0.200±n/a nM
Citation Chidester, CGLin, CHLahti, RAHaadsma-Svensson, SRSmith, MW Comparison of 5-HT1A and dopamine D2 pharmacophores. X-ray structures and affinities of conformationally constrained ligands. J Med Chem36:1301-15 (1993) 5-hydroxytryptamine receptor 1A
Name:5-hydroxytryptamine receptor 1A
Type:n/a
Mol. Mass.:46122.49
Organism:Homo sapiens (Human)
Description:n/a
Residue:422
BDBM50034330
NameBDBM50034330
Synonyms:(3aR,9bS) 3-Allyl-9-methoxy-2,3,3a,4,5,9b-hexahydro-1H-benzo[e]indole (3aS,9bR) 3-Allyl-9-methoxy-2,3,3a,4,5,9b-hexahydro-1H-benzo[e]indole CHEMBL26118
TypeSmall organic molecule
Emp. Form.C16H21NO
Mol. Mass.243.344
SMILESCOc1cccc2CC[C@@H]3[C@@H](CCN3CC=C)c12