Reaction Details
TargetD(2) dopamine receptor
LigandBDBM50047138
Substrate/Competitorn/a
Meas. Tech.ChEBML_62562
Ki 0.470000±n/a nM
Citation Chidester, CGLin, CHLahti, RAHaadsma-Svensson, SRSmith, MW Comparison of 5-HT1A and dopamine D2 pharmacophores. X-ray structures and affinities of conformationally constrained ligands. J Med Chem36:1301-15 (1993) D(2) dopamine receptor
Name:D(2) dopamine receptor
Type:G Protein-Coupled Receptor (GPCR)
Mol. Mass.:50931.60
Organism:Rattus norvegicus (rat)
Description:P61169
Residue:444
BDBM50047138
NameBDBM50047138
Synonyms:CHEMBL25074 SDZ-208-912 | SDZ-HDC-912
TypeSmall organic molecule
Emp. Form.C20H26ClN3O
Mol. Mass.359.893
SMILESCN1C[C@H](CC2[C@H]1Cc1c(Cl)[nH]c3cccc2c13)NC(=O)C(C)(C)C