Reaction Details
TargetRyanodine receptor 1
LigandBDBM50044995
Substrate/Competitorn/a
Meas. Tech.ChEBML_198268
IC50 2.6±n/a nM
Citation Gerzon, KHumerickhouse, RABesch, HRBidasee, KREmmick, JTRoeske, RWTian, ZRuest, LSutko, JL Amino- and guanidinoacylryanodines: basic ryanodine esters with enhanced affinity for the sarcoplasmic reticulum Ca(2+)-release channel. J Med Chem36:1319-23 (1993) Ryanodine receptor 1
Name:Ryanodine receptor 1
Type:PROTEIN
Mol. Mass.:565099.26
Organism:Oryctolagus cuniculus
Description:ChEMBL_19634
Residue:5037
BDBM50044995
NameBDBM50044995
Synonyms:(O10eq)-beta-alanylryanodine | CHEMBL282089
TypeSmall organic molecule
Emp. Form.C28H40N2O10
Mol. Mass.564.6246
SMILESCC(C)C1(O)[C@@H](OC(=O)c2ccc[nH]2)C2(O)[C@@]3(C)CC4(O)OC5([C@H](OC(=O)CCN)C(C)CCC35O)C2(O)C14C