Reaction Details
TargetRyanodine receptor 1
LigandBDBM50044989
Substrate/Competitorn/a
Meas. Tech.ChEBML_198268
IC50 1.1±n/a nM
Citation Gerzon, KHumerickhouse, RABesch, HRBidasee, KREmmick, JTRoeske, RWTian, ZRuest, LSutko, JL Amino- and guanidinoacylryanodines: basic ryanodine esters with enhanced affinity for the sarcoplasmic reticulum Ca(2+)-release channel. J Med Chem36:1319-23 (1993) Ryanodine receptor 1
Name:Ryanodine receptor 1
Type:PROTEIN
Mol. Mass.:565099.26
Organism:Oryctolagus cuniculus
Description:ChEMBL_19634
Residue:5037
BDBM50044989
NameBDBM50044989
Synonyms:(O10eq)-beta-guanidinopropionylryanodine | CHEMBL27669
TypeSmall organic molecule
Emp. Form.C29H42N4O10
Mol. Mass.606.6646
SMILESCC(C)C1(O)[C@@H](OC(=O)c2ccc[nH]2)C2(O)[C@@]3(C)CC4(O)OC5([C@H](OC(=O)CCNC(N)=N)C(C)CCC35O)C2(O)C14C