Reaction Details
TargetKappa-type opioid receptor
LigandBDBM50000293
Substrate/Competitorn/a
Meas. Tech.ChEBML_145680
IC50 0.100000±n/a nM
Citation Naylor, AJudd, DBLloyd, JEScopes, DIHayes, AGBirch, PJ A potent new class of kappa-receptor agonist: 4-substituted 1-(arylacetyl)-2-[(dialkylamino)methyl]piperazines. J Med Chem36:2075-83 (1993) Kappa-type opioid receptor
Name:Kappa-type opioid receptor
Type:G Protein-Coupled Receptor (GPCR)
Mol. Mass.:42648.76
Organism:Homo sapiens (Human)
Description:P41145
Residue:380
BDBM50000293
NameBDBM50000293
Synonyms:2-(3,4-Dichloro-phenyl)-1-(7-pyrrolidin-1-ylmethyl-1,4-dioxa-8-aza-spiro[4.5]dec-8-yl)-ethanone GR-45809
TypeSmall organic molecule
Emp. Form.C20H26Cl2N2O3
Mol. Mass.413.338
SMILESClc1ccc(CC(=O)N2CCC3(CC2CN2CCCC2)OCCO3)cc1Cl