Reaction Details
TargetKappa-type opioid receptor
LigandBDBM50045189
Substrate/Competitorn/a
Meas. Tech.ChEBML_145680
IC50 0.420000±n/a nM
Citation Naylor, AJudd, DBLloyd, JEScopes, DIHayes, AGBirch, PJ A potent new class of kappa-receptor agonist: 4-substituted 1-(arylacetyl)-2-[(dialkylamino)methyl]piperazines. J Med Chem36:2075-83 (1993) Kappa-type opioid receptor
Name:Kappa-type opioid receptor
Type:G Protein-Coupled Receptor (GPCR)
Mol. Mass.:42648.76
Organism:Homo sapiens (Human)
Description:P41145
Residue:380
BDBM50045189
NameBDBM50045189
Synonyms:1-{4-[2-(3,4-Dichloro-phenyl)-acetyl]-3-pyrrolidin-1-ylmethyl-piperazin-1-yl}-propenone | CHEMBL63810
TypeSmall organic molecule
Emp. Form.C20H25Cl2N3O2
Mol. Mass.410.337
SMILESClc1ccc(CC(=O)N2CCN(CC2CN2CCCC2)C(=O)C=C)cc1Cl