Reaction Details
TargetKappa-type opioid receptor
LigandBDBM50045193
Substrate/Competitorn/a
Meas. Tech.ChEBML_145680
IC50 0.340000±n/a nM
Citation Naylor, AJudd, DBLloyd, JEScopes, DIHayes, AGBirch, PJ A potent new class of kappa-receptor agonist: 4-substituted 1-(arylacetyl)-2-[(dialkylamino)methyl]piperazines. J Med Chem36:2075-83 (1993) Kappa-type opioid receptor
Name:Kappa-type opioid receptor
Type:G Protein-Coupled Receptor (GPCR)
Mol. Mass.:42648.76
Organism:Homo sapiens (Human)
Description:P41145
Residue:380
BDBM50045193
NameBDBM50045193
Synonyms:4-[2-(3,4-Dichloro-phenyl)-acetyl]-3-(3-oxo-pyrrolidin-1-ylmethyl)-piperazine-1-carboxylic acid methyl ester | CHEMBL62884
TypeSmall organic molecule
Emp. Form.C19H23Cl2N3O4
Mol. Mass.428.31
SMILESCOC(=O)N1CCN(C(CN2CCC(=O)C2)C1)C(=O)Cc1ccc(Cl)c(Cl)c1