Reaction Details
TargetKappa-type opioid receptor
LigandBDBM50045195
Substrate/Competitorn/a
Meas. Tech.ChEBML_145680
IC50 450±n/a nM
Citation Naylor, AJudd, DBLloyd, JEScopes, DIHayes, AGBirch, PJ A potent new class of kappa-receptor agonist: 4-substituted 1-(arylacetyl)-2-[(dialkylamino)methyl]piperazines. J Med Chem36:2075-83 (1993) Kappa-type opioid receptor
Name:Kappa-type opioid receptor
Type:G Protein-Coupled Receptor (GPCR)
Mol. Mass.:42648.76
Organism:Homo sapiens (Human)
Description:P41145
Residue:380
BDBM50045195
NameBDBM50045195
Synonyms:4-[2-(3,4-Dichloro-phenyl)-acetyl]-3-pyrrolidin-1-ylmethyl-piperazine-1-carboxylic acid benzyl ester | CHEMBL63367
TypeSmall organic molecule
Emp. Form.C25H29Cl2N3O3
Mol. Mass.490.422
SMILESClc1ccc(CC(=O)N2CCN(CC2CN2CCCC2)C(=O)OCc2ccccc2)cc1Cl