Reaction Details
TargetKappa-type opioid receptor
LigandBDBM50045197
Substrate/Competitorn/a
Meas. Tech.ChEBML_145680
IC50>10000±n/a nM
Citation Naylor, AJudd, DBLloyd, JEScopes, DIHayes, AGBirch, PJ A potent new class of kappa-receptor agonist: 4-substituted 1-(arylacetyl)-2-[(dialkylamino)methyl]piperazines. J Med Chem36:2075-83 (1993) Kappa-type opioid receptor
Name:Kappa-type opioid receptor
Type:G Protein-Coupled Receptor (GPCR)
Mol. Mass.:42648.76
Organism:Homo sapiens (Human)
Description:P41145
Residue:380
BDBM50045197
NameBDBM50045197
Synonyms:1-(4-Benzoyl-2-pyrrolidin-1-ylmethyl-piperazin-1-yl)-2-(3,4-dichloro-phenyl)-ethanone | CHEMBL302190
TypeSmall organic molecule
Emp. Form.C24H27Cl2N3O2
Mol. Mass.460.396
SMILESClc1ccc(CC(=O)N2CCN(CC2CN2CCCC2)C(=O)c2ccccc2)cc1Cl