Reaction Details
TargetKappa-type opioid receptor
LigandBDBM50045198
Substrate/Competitorn/a
Meas. Tech.ChEBML_145680
IC50 1.2±n/a nM
Citation Naylor, AJudd, DBLloyd, JEScopes, DIHayes, AGBirch, PJ A potent new class of kappa-receptor agonist: 4-substituted 1-(arylacetyl)-2-[(dialkylamino)methyl]piperazines. J Med Chem36:2075-83 (1993) Kappa-type opioid receptor
Name:Kappa-type opioid receptor
Type:G Protein-Coupled Receptor (GPCR)
Mol. Mass.:42648.76
Organism:Homo sapiens (Human)
Description:P41145
Residue:380
BDBM50045198
NameBDBM50045198
Synonyms:4-[2-(3,4-Dichloro-phenyl)-acetyl]-3-dimethylaminomethyl-piperazine-1-carboxylic acid methyl ester | CHEMBL304900
TypeSmall organic molecule
Emp. Form.C17H23Cl2N3O3
Mol. Mass.388.289
SMILESCOC(=O)N1CCN(C(CN(C)C)C1)C(=O)Cc1ccc(Cl)c(Cl)c1