Reaction Details
TargetMuscarinic acetylcholine receptor M2
LigandBDBM50044696
Substrate/Competitorn/a
Meas. Tech.ChEMBL_98749 (CHEMBL874151)
Ki 7800±n/a nM
Citation Tsukamoto, SIchihara, MWanibuchi, FUsuda, SHidaka, KHarada, MTamura, T Synthesis and structure-activity studies of a series of spirooxazolidine-2,4-diones: 4-oxa analogues of the muscarinic agonist 2-ethyl-8-methyl-2,8-diazaspiro[4.5]decane-1,3-dione. J Med Chem36:2292-9 (1993) Muscarinic acetylcholine receptor M2
Name:Muscarinic acetylcholine receptor M2
Type:Enzyme Catalytic Domain
Mol. Mass.:51555.53
Organism:RAT
Description:P10980
Residue:466
BDBM50044696
NameBDBM50044696
Synonyms:3-Ethyl-8-methyl-1-oxa-3,8-diaza-spiro[4.5]decane-2,4-dione; hydrochloride | CHEMBL553520
TypeSmall organic molecule
Emp. Form.C10H16N2O3
Mol. Mass.212.2456
SMILESCCN1C(=O)OC2(CCN(C)CC2)C1=O