Reaction Details
TargetMuscarinic acetylcholine receptor M1
LigandBDBM50044697
Substrate/Competitorn/a
Meas. Tech.ChEBML_139962
Ki>10000±n/a nM
Citation Tsukamoto, SIchihara, MWanibuchi, FUsuda, SHidaka, KHarada, MTamura, T Synthesis and structure-activity studies of a series of spirooxazolidine-2,4-diones: 4-oxa analogues of the muscarinic agonist 2-ethyl-8-methyl-2,8-diazaspiro[4.5]decane-1,3-dione. J Med Chem36:2292-9 (1993) Muscarinic acetylcholine receptor M1
Name:Muscarinic acetylcholine receptor M1
Type:Enzyme Catalytic Domain
Mol. Mass.:51390.46
Organism:RAT
Description:P08482
Residue:460
BDBM50044697
NameBDBM50044697
Synonyms:(3-Chloro-phenyl)-carbamic acid 4-(3-ethyl-2,4-dioxo-1-oxa-3,8-diaza-spiro[4.5]dec-8-yl)-but-2-ynyl ester | CHEMBL542879
TypeSmall organic molecule
Emp. Form.C20H22ClN3O5
Mol. Mass.419.859
SMILESCCN1C(=O)OC2(CCN(CC#CCOC(=O)Nc3cccc(Cl)c3)CC2)C1=O