Reaction Details
TargetMuscarinic acetylcholine receptor M1
LigandBDBM50044704
Substrate/Competitorn/a
Meas. Tech.ChEBML_139962
Ki 1500±n/a nM
Citation Tsukamoto, SIchihara, MWanibuchi, FUsuda, SHidaka, KHarada, MTamura, T Synthesis and structure-activity studies of a series of spirooxazolidine-2,4-diones: 4-oxa analogues of the muscarinic agonist 2-ethyl-8-methyl-2,8-diazaspiro[4.5]decane-1,3-dione. J Med Chem36:2292-9 (1993) Muscarinic acetylcholine receptor M1
Name:Muscarinic acetylcholine receptor M1
Type:Enzyme Catalytic Domain
Mol. Mass.:51390.46
Organism:RAT
Description:P08482
Residue:460
BDBM50044704
NameBDBM50044704
Synonyms:3-tert-Butyl-8-methyl-1-oxa-3,8-diaza-spiro[4.5]decane-2,4-dione; hydrochloride | CHEMBL552656
TypeSmall organic molecule
Emp. Form.C12H20N2O3
Mol. Mass.240.2988
SMILESCN1CCC2(CC1)OC(=O)N(C2=O)C(C)(C)C