Reaction Details
TargetKappa-type opioid receptor
LigandBDBM82551
Substrate/Competitorn/a
Meas. Tech.ChEBML_220927
IC50 181±n/a nM
Citation Lin, CETakemori, AEPortoghese, PS Synthesis and kappa-opioid antagonist selectivity of a norbinaltorphimine congener. Identification of the address moiety required for kappa-antagonist activity. J Med Chem36:2412-5 (1993) Kappa-type opioid receptor
Name:Kappa-type opioid receptor
Type:G Protein-Coupled Receptor (GPCR)
Mol. Mass.:42744.99
Organism:Cavia porcellus (domestic guinea pig)
Description:P41144
Residue:380
BDBM82551
NameBDBM82551
Synonyms:C18130 NOR-BNI (HCI)2 | NORBNI
TypeSmall organic molecule
Emp. Form.C40H43N3O6
Mol. Mass.661.7859
SMILESOc1ccc2C[C@H]3N(CC4CC4)CC[C@@]45[C@@H](Oc1c24)c1[nH]c2[C@@H]4Oc6c7c(C[C@H]8N(CC9CC9)CC[C@@]47[C@@]8(O)Cc2c1C[C@@]35O)ccc6O