Reaction Details
TargetAdenosine receptor A1
LigandBDBM50044431
Substrate/Competitorn/a
Meas. Tech.ChEBML_29637
Ki 0.190000±n/a nM
Citation Suzuki, FShimada, JShiozaki, SIchikawa, SIshii, ANakamura, JNonaka, HKobayashi, HFuse, E Adenosine A1 antagonists. 3. Structure-activity relationships on amelioration against scopolamine- or N6-((R)-phenylisopropyl)adenosine-induced cognitive disturbance. J Med Chem36:2508-18 (1993) Adenosine receptor A1
Name:Adenosine receptor A1
Type:Protein
Mol. Mass.:36704.13
Organism:Rattus norvegicus (rat)
Description:n/a
Residue:326
BDBM50044431
NameBDBM50044431
Synonyms:8-(Hexahydro-2,5-methano-pentalen-3a-yl)-1,3-dipropyl-2-thioxo-1,2,3,7-tetrahydro-purin-6-one | CHEMBL82589
TypeSmall organic molecule
Emp. Form.C20H28N4OS
Mol. Mass.372.528
SMILESCCCn1c2nc([nH]c2c(=O)n(CCC)c1=S)C12CC3CC1CC(C2)C3