Reaction Details
TargetEndothelin-1 receptor
LigandBDBM50045256
Substrate/Competitorn/a
Meas. Tech.ChEMBL_65825 (CHEMBL682959)
EC50 1900±n/a nM
Citation Doherty, AMCody, WLDePue, PLHe, JXWaite, LALeonard, DMLeitz, NLDudley, DTRapundalo, STHingorani, GP Structure-activity relationships of C-terminal endothelin hexapeptide antagonists. J Med Chem36:2585-94 (1993) Endothelin-1 receptor
Name:Endothelin-1 receptor
Type:Enzyme Catalytic Domain
Mol. Mass.:48736.88
Organism:Homo sapiens (Human)
Description:P25101
Residue:427
BDBM50045256
NameBDBM50045256
Synonyms:CHEMBL2370067 | D-Dip-Leu-Asp-Ile-Ile-Trp
TypeSmall organic molecule
Emp. Form.C48H63N7O8
Mol. Mass.866.0559
SMILESCC[C@H](C)[C@H](NC(=O)[C@H](CC(O)=O)NC(=O)[C@H](CC(C)C)NC(=O)[C@H](N)C(c1ccccc1)c1ccccc1)C(=O)N[C@@H]([C@@H](C)CC)C(=O)N[C@@H](Cc1c[nH]c2ccccc12)C=O