Reaction Details
TargetEndothelin-1 receptor
LigandBDBM50045264
Substrate/Competitorn/a
Meas. Tech.ChEMBL_65825 (CHEMBL682959)
EC50 17±n/a nM
Citation Doherty, AMCody, WLDePue, PLHe, JXWaite, LALeonard, DMLeitz, NLDudley, DTRapundalo, STHingorani, GP Structure-activity relationships of C-terminal endothelin hexapeptide antagonists. J Med Chem36:2585-94 (1993) Endothelin-1 receptor
Name:Endothelin-1 receptor
Type:Enzyme Catalytic Domain
Mol. Mass.:48736.88
Organism:Homo sapiens (Human)
Description:P25101
Residue:427
BDBM50045264
NameBDBM50045264
Synonyms:Ac-D-Dip-Leu-Asp-Val-Ile-Trp | CHEMBL315841
TypeSmall organic molecule
Emp. Form.C49H63N7O10
Mol. Mass.910.0654
SMILESCC[C@H](C)[C@H](NC(=O)[C@@H](NC(=O)[C@H](CC(O)=O)NC(=O)[C@H](CC(C)C)NC(=O)[C@H](NC(C)=O)C(c1ccccc1)c1ccccc1)C(C)C)C(=O)N[C@@H](Cc1c[nH]c2ccccc12)C(O)=O