Reaction Details
TargetType-1 angiotensin II receptor A
LigandBDBM50045358
Substrate/Competitorn/a
Meas. Tech.ChEBML_36154
Ki 21±n/a nM
Citation Winn, MDe, BZydowsky, TMAltenbach, RJBasha, FZBoyd, SABrune, MEBuckner, SACrowell, DDrizin, I 2-(Alkylamino)nicotinic acid and analogs. Potent angiotensin II antagonists. J Med Chem36:2676-88 (1993) Type-1 angiotensin II receptor A
Name:Type-1 angiotensin II receptor A
Type:Enzyme Catalytic Domain
Mol. Mass.:40910.53
Organism:RAT
Description:ANGIOTENSIN AT1 AGTR1 RAT::P25095
Residue:359
BDBM50045358
NameBDBM50045358
Synonyms:2-Ethyl-4-{[2'-(1H-tetrazol-5-yl)-biphenyl-4-ylmethyl]-amino}-pyrimidine-5-carboxylic acid ethyl ester | CHEMBL89877
TypeSmall organic molecule
Emp. Form.C23H23N7O2
Mol. Mass.429.4744
SMILESCCOC(=O)c1cnc(CC)nc1NCc1ccc(cc1)-c1ccccc1-c1nnn[nH]1