Reaction Details
TargetDNA topoisomerase 1
LigandBDBM50008922
Substrate/Competitorn/a
Meas. Tech.ChEBML_208261
IC50 110±n/a nM
Citation Wall, MEWani, MCNicholas, AWManikumar, GTele, CMoore, LTruesdale, ALeitner, PBesterman, JM Plant antitumor agents. 30. Synthesis and structure activity of novel camptothecin analogs. J Med Chem36:2689-700 (1993) DNA topoisomerase 1
Name:DNA topoisomerase 1
Type:Enzyme
Mol. Mass.:90771.02
Organism:Homo sapiens (Human)
Description:P11387
Residue:765
BDBM50008922
NameBDBM50008922
Synonyms:(20S)-4-Ethyl-4,9-dihydroxy-1,12-dihydro-4H-2-oxa-6,12a-diaza-dibenzo[b,h]fluorene-3,13-dione 10-hydroxy-camptothecin 4-Ethyl-4,10-dihydroxy-1,12-dihydro-4H-2-oxa-6,12a-diaza-dibenzo[b,h]fluorene-3,13-dione 4-Ethyl-4,9-dihydroxy-1,12-dihydro-4H-2-oxa-6,12a-diaza-dibenzo[b,h]fluorene-3,13-dione (10-hydroxycamptothecin) | CHEMBL273862
TypeSmall organic molecule
Emp. Form.C20H16N2O5
Mol. Mass.364.3514
SMILESCC[C@@]1(O)C(=O)OCc2c1cc1-c3nc4ccc(O)cc4cc3Cn1c2=O