Reaction Details
TargetDNA topoisomerase 1
LigandBDBM50008935
Substrate/Competitorn/a
Meas. Tech.ChEBML_208261
IC50 1000±n/a nM
Citation Wall, MEWani, MCNicholas, AWManikumar, GTele, CMoore, LTruesdale, ALeitner, PBesterman, JM Plant antitumor agents. 30. Synthesis and structure activity of novel camptothecin analogs. J Med Chem36:2689-700 (1993) DNA topoisomerase 1
Name:DNA topoisomerase 1
Type:Enzyme
Mol. Mass.:90771.02
Organism:Homo sapiens (Human)
Description:P11387
Residue:765
BDBM50008935
NameBDBM50008935
Synonyms:(20S)-10-Dimethylaminomethyl-4-ethyl-4,9-dihydroxy-1,12-dihydro-4H-2-oxa-6,12a-diaza-dibenzo[b,h]fluorene-3,13-dione (S)-10-[(DIMETHYLAMINO)METHYL]-4-ETHYL-4,9-DIHYDROXY-1H-PYRANO[3'',4'':6,7]INOLIZINO[1,2-B]-QUINOLINE-3,14(4H,12H)-DIONE (S)-11-Dimethylaminomethyl-4-ethyl-4,9-dihydroxy-1,12-dihydro-4H-2-oxa-6,12a-diaza-dibenzo[b,h]fluorene-3,13-dione 10-Dimethylaminomethyl-4-ethyl-4,9-dihydroxy-1,12-dihydro-4H-2-oxa-6,12a-diaza-dibenzo[b,h]fluorene-3,13-dione (Topotecan) 10-dimethylaminomethyl-4-ethyl-4,9-dihydroxy-(4S)-3,4,12,14-tetrahydro-1H-pyrano[3'',4'':6,7]indolizino[1,2-b]quinoline-3,14-dione Hycamtin TOPOTECAN HYDROCHLORIDE | cid_60700
TypeSmall organic molecule
Emp. Form.C23H23N3O5
Mol. Mass.421.4458
SMILESCC[C@@]1(O)C(=O)OCc2c1cc1-c3nc4ccc(O)c(CN(C)C)c4cc3Cn1c2=O