Reaction Details
TargetDNA topoisomerase 1
LigandBDBM50045398
Substrate/Competitorn/a
Meas. Tech.ChEBML_208261
IC50 130±n/a nM
Citation Wall, MEWani, MCNicholas, AWManikumar, GTele, CMoore, LTruesdale, ALeitner, PBesterman, JM Plant antitumor agents. 30. Synthesis and structure activity of novel camptothecin analogs. J Med Chem36:2689-700 (1993) DNA topoisomerase 1
Name:DNA topoisomerase 1
Type:Enzyme
Mol. Mass.:90771.02
Organism:Homo sapiens (Human)
Description:P11387
Residue:765
BDBM50045398
NameBDBM50045398
Synonyms:(20S)-9-Bromo-4-ethyl-4-hydroxy-1,12-dihydro-4H-2-oxa-6,12a-diaza-dibenzo[b,h]fluorene-3,13-dione | CHEMBL91051
TypeSmall organic molecule
Emp. Form.C20H15BrN2O4
Mol. Mass.427.248
SMILESCCC1(O)C(=O)OCc2c1cc1-c3nc4ccc(Br)cc4cc3Cn1c2=O