Reaction Details
Target5-hydroxytryptamine receptor 1A
LigandBDBM50041953
Substrate/Competitorn/a
Meas. Tech.ChEMBL_1138 (CHEMBL616083)
Ki 17±n/a nM
Citation Zhuang, ZPKung, MPKung, HF Synthesis of (R,S)-trans-8-hydroxy-2-[N-n-propyl-N-(3'-iodo-2'-propenyl)amino]tetral in (trans-8-OH-PIPAT): a new 5-HT1A receptor ligand. J Med Chem36:3161-5 (1993) 5-hydroxytryptamine receptor 1A
Name:5-hydroxytryptamine receptor 1A
Type:G Protein-Coupled Receptor (GPCR)
Mol. Mass.:46445.29
Organism:Rattus norvegicus (rat)
Description:Binding assays were performed using rat hippocampal membranes.
Residue:422
BDBM50041953
NameBDBM50041953
Synonyms:(R,S) (3-Iodo-allyl)-(8-methoxy-1,2,3,4-tetrahydro-naphthalen-2-yl)-amine | CHEMBL323786
TypeSmall organic molecule
Emp. Form.C14H18INO
Mol. Mass.343.2033
SMILESCOc1cccc2CCC(Cc12)NC\C=C\I