Reaction Details
Target5-hydroxytryptamine receptor 1A
LigandBDBM69602
Substrate/Competitorn/a
Meas. Tech.ChEBML_1137
Ki 2.7±n/a nM
Citation Zhuang, ZPKung, MPKung, HF Synthesis of (R,S)-trans-8-hydroxy-2-[N-n-propyl-N-(3'-iodo-2'-propenyl)amino]tetral in (trans-8-OH-PIPAT): a new 5-HT1A receptor ligand. J Med Chem36:3161-5 (1993) 5-hydroxytryptamine receptor 1A
Name:5-hydroxytryptamine receptor 1A
Type:G Protein-Coupled Receptor (GPCR)
Mol. Mass.:46445.29
Organism:Rattus norvegicus (rat)
Description:Binding assays were performed using rat hippocampal membranes.
Residue:422
BDBM69602
NameBDBM69602
Synonyms:2,3-dihydro-1,4-benzodioxin-3-ylmethyl-[2-(2,6-dimethoxyphenoxy)ethyl]amine;hydrochloride MLS000859914 SMR000326775 WB-4101 hydrochloride | cid_11957505
TypeSmall organic molecule
Emp. Form.C19H23NO5
Mol. Mass.345.3896
SMILESCOc1cccc(OC)c1OCCNCC1COc2ccccc2O1