Reaction Details
TargetDelta-type opioid receptor
LigandBDBM50068664
Substrate/Competitorn/a
Meas. Tech.ChEBML_147186
Ki 0.308±n/a nM
Citation Schiller, PWWeltrowska, GNguyen, TMWilkes, BCChung, NNLemieux, C TIPP[psi]: a highly potent and stable pseudopeptide delta opioid receptor antagonist with extraordinary delta selectivity. J Med Chem36:3182-7 (1993) Delta-type opioid receptor
Name:Delta-type opioid receptor
Type:G Protein-Coupled Receptor (GPCR)
Mol. Mass.:40465.04
Organism:Rattus norvegicus (rat)
Description:Competition binding assays were using CHO-K1 cell membranes expressing the opioid receptor.
Residue:372
BDBM50068664
NameBDBM50068664
Synonyms:2-[2-({(S)-2-[2-Amino-3-(4-hydroxy-phenyl)-propionyl]-4-methyl-1,2,3,4-tetrahydro-isoquinoline-3-carbonyl}-amino)-3-phenyl-propionylamino]-3-phenyl-propionic acid | CHEMBL191751
TypeSmall organic molecule
Emp. Form.C37H38N4O6
Mol. Mass.634.7208
SMILESN[C@@H](Cc1ccc(O)cc1)C(=O)N1Cc2ccccc2C[C@H]1C(=O)N[C@@H](Cc1ccccc1)C(=O)N[C@@H](Cc1ccccc1)C(O)=O