Reaction Details
TargetSubstance-P receptor
LigandBDBM50033658
Substrate/Competitorn/a
Meas. Tech.ChEMBL_141769 (CHEMBL748486)
Ki 20±n/a nM
Citation Rosen, TSeeger, TFMcLean, SDesai, MCGuarino, KJBryce, DPratt, KHeym, JChalabi, PMWindels, JH Synthesis, in vitro binding profile, and autoradiographic analysis of [3H]-cis-3-[(2-methoxybenzyl)amino]-2-phenylpiperidine, a highly potent and selective nonpeptide substance P receptor antagonist radioligand. J Med Chem36:3197-201 (1993) Substance-P receptor
Name:Substance-P receptor
Type:Enzyme Catalytic Domain
Mol. Mass.:46261.42
Organism:GUINEA PIG
Description:Neurokinin NK1 TACR1 GUINEA PIG::P30547
Residue:407
BDBM50033658
NameBDBM50033658
Synonyms:Arg-Pro-Lys-Pro-Gln-Gln-Phe-Phe-Sarcosine-Leu-Met(O2)-amine | CHEMBL2370435
TypeSmall organic molecule
Emp. Form.C64H100N18O15S
Mol. Mass.1393.655
SMILES[#6]-[#6](-[#6])-[#6]-[#6@H](-[#7]-[#6](=O)-[#6@H](-[#6])-[#7]-[#6](=O)-[#6@H](-[#6]-c1ccccc1)-[#7]-[#6](=O)-[#6@H](-[#6]-c1ccccc1)-[#7]-[#6](=O)-[#6@H](-[#6]-[#6]-[#6](-[#7])=O)-[#7]-[#6](=O)-[#6@H](-[#6]-[#6]-[#6](-[#7])=O)-[#7]-[#6](=O)-[#6@@H]-1-[#6]-[#6]-[#6]-[#7]-1-[#6](=O)-[#6@H](-[#6]-[#6]-[#6]-[#6]-[#7])-[#7]-[#6](=O)-[#6@@H]-1-[#6]-[#6]-[#6]-[#7]-1-[#6](=O)-[#6@@H](-[#7])-[#6]-[#6]-[#6]\[#7]=[#6](\[#7])-[#7])-[#6](=O)-[#7]-[#6@@H](-[#6]-[#6]S([#6])(=O)=O)-[#6](-[#7])=O