Reaction Details
TargetLeukotriene B4 receptor 1
LigandBDBM50042146
Substrate/Competitorn/a
Meas. Tech.ChEBML_99839
Ki 600±n/a nM
Citation Kingsbury, WDPendrak, ILeber, JDBoehm, JCMallet, BSarau, HMFoley, JJSchmidt, DBDaines, RA Synthesis of structural analogs of leukotriene B4 and their receptor binding activity. J Med Chem36:3308-20 (1993) Leukotriene B4 receptor 1
Name:Leukotriene B4 receptor 1
Type:Enzyme Catalytic Domain
Mol. Mass.:37582.68
Organism:Homo sapiens (Human)
Description:Q15722
Residue:352
BDBM50042146
NameBDBM50042146
Synonyms:3-[7-(1-Hydroxy-nonyl)-quinolin-2-ylmethylsulfanyl]-benzoic acid | CHEMBL113792
TypeSmall organic molecule
Emp. Form.C26H31NO3S
Mol. Mass.437.594
SMILESCCCCCCCCC(O)c1ccc2ccc(CSc3cccc(c3)C(O)=O)nc2c1