Reaction Details
Target5-hydroxytryptamine receptor 1A
LigandBDBM50054067
Substrate/Competitorn/a
Meas. Tech.ChEBML_1317
Ki 3260±n/a nM
Citation Sonesson, CBoije, MSvensson, KEkman, ACarlsson, ARomero, AGMartin, IJDuncan, JNKing, LJWikström, H Orally active central dopamine and serotonin receptor ligands: 5-, 6-, 7-, and 8-[[trifluoromethyl)sulfonyl]oxy]-2-(di-n-propylamino)tetralins and the formation of active metabolites in vivo. J Med Chem36:3409-16 (1993) 5-hydroxytryptamine receptor 1A
Name:5-hydroxytryptamine receptor 1A
Type:G Protein-Coupled Receptor (GPCR)
Mol. Mass.:46445.29
Organism:Rattus norvegicus (rat)
Description:Binding assays were performed using rat hippocampal membranes.
Residue:422
BDBM50054067
NameBDBM50054067
Synonyms:(2R)-7-Dipropylamino-5,6,7,8-tetrahydro-naphthalen-2-ol (R)-7-(dipropylamino)-5,6,7,8-tetrahydronaphthalen-2-ol (R)-7-Dipropylamino-5,6,7,8-tetrahydro-naphthalen-2-ol.HCl CHEMBL301559
TypeSmall organic molecule
Emp. Form.C16H25NO
Mol. Mass.247.3758
SMILESCCCN(CCC)[C@@H]1CCc2ccc(O)cc2C1