Reaction Details
Target5-hydroxytryptamine receptor 1A
LigandBDBM50368723
Substrate/Competitorn/a
Meas. Tech.ChEMBL_1106 (CHEMBL616290)
Ki 0.002700±n/a nM
Citation Kawakubo, HTakagi, SYamaura, YKatoh, SIshimoto, YNagatani, TMochizuki, DKamata, TSasaki, Y (R)-1,2,3,4-tetrahydro[1]benzothieno[2,3-c]pyridines: novel optically active compounds with strong 5-HT1A receptor binding ability exhibiting anticonflict activity and lessening of memory impairment. J Med Chem36:3526-32 (1994) 5-hydroxytryptamine receptor 1A
Name:5-hydroxytryptamine receptor 1A
Type:G Protein-Coupled Receptor (GPCR)
Mol. Mass.:46445.29
Organism:Rattus norvegicus (rat)
Description:Binding assays were performed using rat hippocampal membranes.
Residue:422
BDBM50368723
NameBDBM50368723
Synonyms:Metanopirone TANDOSPIRONE HYDROCHLORIDE | Tandospirone
TypeSmall organic molecule
Emp. Form.C21H29N5O2
Mol. Mass.383.4873
SMILESO=C1[C@H]2[C@@H]3CC[C@@H](C3)[C@H]2C(=O)N1CCCCN1CCN(CC1)c1ncccn1