Reaction Details
TargetMuscarinic acetylcholine receptor M2
LigandBDBM50004737
Substrate/Competitorn/a
Meas. Tech.ChEMBL_98894 (CHEMBL703402)
Ki 15±n/a nM
Citation Trybulski, EJZhang, JKramss, RHMangano, RM The synthesis and biochemical pharmacology of enantiomerically pure methylated oxotremorine derivatives. J Med Chem36:3533-41 (1994) Muscarinic acetylcholine receptor M2
Name:Muscarinic acetylcholine receptor M2
Type:Enzyme Catalytic Domain
Mol. Mass.:51555.53
Organism:RAT
Description:P10980
Residue:466
BDBM50004737
NameBDBM50004737
Synonyms:3-Methyl-1-(4-pyrrolidin-1-yl-but-2-ynyl)-pyrrolidin-2-one | CHEMBL109815
TypeSmall organic molecule
Emp. Form.C13H20N2O
Mol. Mass.220.3107
SMILESCC1CCN(CC#CCN2CCCC2)C1=O