Reaction Details
TargetAmine oxidase [flavin-containing] B
LigandBDBM50042586
Substrate/Competitorn/a
Meas. Tech.ChEBML_99764
Ki 6700000±n/a nM
Citation Ding, CZSilverman, RB Transformation of heterocyclic reversible monoamine oxidase-B inactivators into irreversible inactivators by N-methylation. J Med Chem36:3606-10 (1994) Amine oxidase [flavin-containing] B
Name:Amine oxidase [flavin-containing] B
Type:PROTEIN
Mol. Mass.:58428.94
Organism:Bos taurus
Description:ChEMBL_1501478
Residue:520
BDBM50042586
NameBDBM50042586
Synonyms:4-Aminomethyl-1-(4-methoxy-phenyl)-pyrrolidin-2-one | CHEMBL120829
TypeSmall organic molecule
Emp. Form.C12H16N2O2
Mol. Mass.220.2676
SMILESCOc1ccc(cc1)N1CC(CN)CC1=O