Reaction Details
TargetAmine oxidase [flavin-containing] B
LigandBDBM50368741
Substrate/Competitorn/a
Meas. Tech.ChEBML_99764
Ki 50000000±n/a nM
Citation Ding, CZSilverman, RB Transformation of heterocyclic reversible monoamine oxidase-B inactivators into irreversible inactivators by N-methylation. J Med Chem36:3606-10 (1994) Amine oxidase [flavin-containing] B
Name:Amine oxidase [flavin-containing] B
Type:PROTEIN
Mol. Mass.:58428.94
Organism:Bos taurus
Description:ChEMBL_1501478
Residue:520
BDBM50368741
NameBDBM50368741
Synonyms:CHEMBL1203214
TypeSmall organic molecule
Emp. Form.C13H18N2O2
Mol. Mass.234.2942
SMILESCNCC1CN(C(=O)C1)c1ccc(OC)cc1