Reaction Details
TargetD(2) dopamine receptor
LigandBDBM84746
Substrate/Competitorn/a
Meas. Tech.ChEBML_62882
Ki>10±n/a nM
Citation Mach, RHLuedtke, RRUnsworth, CDBoundy, VANowak, PAScripko, JGElder, STJackson, JRHoffman, PLEvora, PH 18F-labeled benzamides for studying the dopamine D2 receptor with positron emission tomography. J Med Chem36:3707-20 (1994) D(2) dopamine receptor
Name:D(2) dopamine receptor
Type:G Protein-Coupled Receptor (GPCR)
Mol. Mass.:50931.60
Organism:Rattus norvegicus (rat)
Description:P61169
Residue:444
BDBM84746
NameBDBM84746
Synonyms:BRL 34778 | BRL-34778
TypeSmall organic molecule
Emp. Form.C23H27ClFN3O2
Mol. Mass.431.931
SMILESCOc1cc(N)c(Cl)cc1C(=O)N[C@H]1C[C@@H]2CCC[C@H](C1)N2Cc1ccc(F)cc1