Reaction Details
TargetD(2) dopamine receptor
LigandBDBM50042732
Substrate/Competitorn/a
Meas. Tech.ChEBML_62882
Ki 0.036000±n/a nM
Citation Mach, RHLuedtke, RRUnsworth, CDBoundy, VANowak, PAScripko, JGElder, STJackson, JRHoffman, PLEvora, PH 18F-labeled benzamides for studying the dopamine D2 receptor with positron emission tomography. J Med Chem36:3707-20 (1994) D(2) dopamine receptor
Name:D(2) dopamine receptor
Type:G Protein-Coupled Receptor (GPCR)
Mol. Mass.:50931.60
Organism:Rattus norvegicus (rat)
Description:P61169
Residue:444
BDBM50042732
NameBDBM50042732
Synonyms:4-Amino-N-(9-benzyl-9-aza-bicyclo[3.3.1]non-3-yl)-5-chloro-2-methoxy-benzamide CHEMBL122533
TypeSmall organic molecule
Emp. Form.C23H28ClN3O2
Mol. Mass.413.94
SMILESCOc1cc(N)c(Cl)cc1C(=O)NC1CC2CCCC(C1)N2Cc1ccccc1