Reaction Details
TargetD(2) dopamine receptor
LigandBDBM50007525
Substrate/Competitorn/a
Meas. Tech.ChEBML_62882
Ki 0.630000±n/a nM
Citation Mach, RHLuedtke, RRUnsworth, CDBoundy, VANowak, PAScripko, JGElder, STJackson, JRHoffman, PLEvora, PH 18F-labeled benzamides for studying the dopamine D2 receptor with positron emission tomography. J Med Chem36:3707-20 (1994) D(2) dopamine receptor
Name:D(2) dopamine receptor
Type:G Protein-Coupled Receptor (GPCR)
Mol. Mass.:50931.60
Organism:Rattus norvegicus (rat)
Description:P61169
Residue:444
BDBM50007525
NameBDBM50007525
Synonyms:CHEMBL123282 | N-(1-Benzyl-piperidin-4-yl)-2,3-dimethoxy-benzamide
TypeSmall organic molecule
Emp. Form.C21H26N2O3
Mol. Mass.354.4427
SMILESCOc1cccc(C(=O)NC2CCN(Cc3ccccc3)CC2)c1OC