Reaction Details
TargetD(3) dopamine receptor
LigandBDBM50042731
Substrate/Competitorn/a
Meas. Tech.ChEBML_61346
Ki 0.450000±n/a nM
Citation Mach, RHLuedtke, RRUnsworth, CDBoundy, VANowak, PAScripko, JGElder, STJackson, JRHoffman, PLEvora, PH 18F-labeled benzamides for studying the dopamine D2 receptor with positron emission tomography. J Med Chem36:3707-20 (1994) D(3) dopamine receptor
Name:D(3) dopamine receptor
Type:n/a
Mol. Mass.:44243.43
Organism:Homo sapiens (Human)
Description:n/a
Residue:400
BDBM50042731
NameBDBM50042731
Synonyms:5-Bromo-N-[1-(4-fluoro-benzyl)-piperidin-4-yl]-2,3-dimethoxy-benzamide | CHEMBL124612
TypeSmall organic molecule
Emp. Form.C21H24BrFN2O3
Mol. Mass.451.329
SMILESCOc1cc(Br)cc(C(=O)NC2CCN(Cc3ccc(F)cc3)CC2)c1OC