Reaction Details
TargetVoltage-dependent L-type calcium channel subunit alpha-1C
LigandBDBM50231574
Substrate/Competitorn/a
Meas. Tech.ChEMBL_92774 (CHEMBL700074)
Ki 2.4±n/a nM
Citation Baindur, NRutledge, ATriggle, DJ A homologous series of permanently charged 1,4-dihydropyridines: novel probes designed to localize drug binding sites on ion channels. J Med Chem36:3743-5 (1994) Voltage-dependent L-type calcium channel subunit alpha-1C
Name:Voltage-dependent L-type calcium channel subunit alpha-1C
Type:Enzyme Catalytic Domain
Mol. Mass.:243492.26
Organism:RAT
Description:Calcium channel 0 RAT::P22002
Residue:2169
BDBM50231574
NameBDBM50231574
Synonyms:CHEMBL3350842
TypeSmall organic molecule
Emp. Form.C25H32F3NO4
Mol. Mass.467.5211
SMILESCCCCCCCCOC(=O)C1=C(C)NC(C)=C(C1c1ccccc1C(F)(F)F)C(=O)OC